Reaction Details
TargetAdenosine receptor A2a
LigandBDBM50065766
Substrate/Competitorn/a
Meas. Tech.ChEMBL_30000 (CHEMBL643011)
Ki 6.97±n/a nM
Citation Kim, YCde Zwart, MChang, LMoro, Svon Frijtag Drabbe Künzel, JKMelman, NIJzerman, APJacobson, KA Derivatives of the triazoloquinazoline adenosine antagonist (CGS 15943) having high potency at the human A2B and A3 receptor subtypes. J Med Chem41:2835-45 (1998) 
 
Adenosine receptor A2a
Name:Adenosine receptor A2a
Type:G Protein-Coupled Receptor (GPCR)
Mol. Mass.:45015.65
Organism:Rattus norvegicus (rat)
Description:Rat A2A receptors expressed in CHO cells.
Residue:410
BDBM50065766
NameBDBM50065766
Synonyms:2-(4-Amino-phenyl)-N-(9-chloro-2-furan-2-yl-[1,2,4]triazolo[1,5-c]quinazolin-5-yl)-acetamide | CHEMBL97748
TypeSmall organic molecule
Emp. Form.C21H15ClN6O2
Mol. Mass.418.836
SMILESNc1ccc(CC(=O)Nc2nc3ccc(Cl)cc3c3nc(nn23)-c2ccco2)cc1