Reaction Details
TargetPeroxisome proliferator-activated receptor alpha
LigandBDBM50462439
Substrate/Competitorn/a
Meas. Tech.ChEMBL_1844151 (CHEMBL4344578)
Kd 16900±n/a nM
Citation Dou, XNath, DShin, HNurmemmedov, EBourne, PCMa, JXDuerfeldt, AS Evolution of a 4-Benzyloxy-benzylamino Chemotype to Provide Efficacious, Potent, and Isoform Selective PPAR? Agonists as Leads for Retinal Disorders. J Med Chem63:2854-2876 (2020) 
 
Peroxisome proliferator-activated receptor alpha
Name:Peroxisome proliferator-activated receptor alpha
Type:Enzyme
Mol. Mass.:52222.08
Organism:Homo sapiens (Human)
Description:Q07869
Residue:468
BDBM50462439
NameBDBM50462439
Synonyms:CHEMBL4237449
TypeSmall organic molecule
Emp. Form.C22H21NO4
Mol. Mass.363.4064
SMILESCOc1ccc(COc2ccc(CNc3cccc(c3)C(O)=O)cc2)cc1