Reaction Details
TargetAlpha-2B adrenergic receptor
LigandBDBM50511341
Substrate/Competitorn/a
Meas. Tech.ChEMBL_1844619 (CHEMBL4345046)
IC50 790±n/a nM
Citation de Lucas, AIVega, JAMatesanz, ELinares, MLGarcía Molina, ATresadern, GLavreysen, HTrabanco, AACid, JM Spiro-oxindole Piperidines and 3-(Azetidin-3-yl)-1 ACS Med Chem Lett11:303-308 (2020) 
 
Alpha-2B adrenergic receptor
Name:Alpha-2B adrenergic receptor
Type:Enzyme
Mol. Mass.:49964.20
Organism:Homo sapiens (Human)
Description:P18089
Residue:450
BDBM50511341
NameBDBM50511341
Synonyms:CHEMBL4483761
TypeSmall organic molecule
Emp. Form.C19H18BrF3N4O2
Mol. Mass.471.271
SMILESCCOc1cc(nnc1C(F)(F)F)N1CCC2(CC1)C(=O)Nc1ccc(Br)cc21