Reaction Details
TargetCyclin-dependent kinase/G2/mitotic-specific cyclin- 1
LigandBDBM50433369
Substrate/Competitorn/a
Meas. Tech.ChEMBL_1846274 (CHEMBL4346815)
IC50 7.6±n/a nM
Citation Tadesse, SCaldon, ECTilley, WWang, S Cyclin-Dependent Kinase 2 Inhibitors in Cancer Therapy: An Update. J Med Chem62:4233-4251 (2019) 
 
Cyclin-dependent kinase/G2/mitotic-specific cyclin- 1
Name:Cyclin-dependent kinase/G2/mitotic-specific cyclin- 1
Type:Protein Complex
Mol. Mass.:n/a
Description:CDK1/Cyclin B complexes were purified from insect cells co-infected with baculovirus vectors containing each of the components.
Components:This complex has 2 components.
Component 1
Name:Cyclin-dependent kinase 1
Synonyms:CDC2 CDK1 CDKN1 Cell division protein kinase 1 P34CDC2 | p34 protein kinase
Type:Enzyme Subunit
Mol. Mass.:34101.08
Organism:Homo sapiens (Human)
Description:P06493
Residue:297
Component 2
Name:G2/mitotic-specific cyclin-B1
Synonyms:CCNB CCNB1_HUMAN
Type:Enzyme Subunit
Mol. Mass.:48340.95
Organism:Homo sapiens (Human)
Description:P14635
Residue:433
BDBM50433369
NameBDBM50433369
Synonyms:CHEMBL2377825
TypeSmall organic molecule
Emp. Form.C16H13N5O5S2
Mol. Mass.419.435
SMILESNc1nc(Nc2ccc(cc2)S(N)(=O)=O)sc1C(=O)c1ccccc1[N+]([O-])=O