Reaction Details
TargetCyclin-dependent kinase 4/G1/S-specific cyclin-D1
LigandBDBM50433369
Substrate/Competitorn/a
Meas. Tech.ChEMBL_1846276 (CHEMBL4346817)
IC50 4.0±n/a nM
Citation Tadesse, SCaldon, ECTilley, WWang, S Cyclin-Dependent Kinase 2 Inhibitors in Cancer Therapy: An Update. J Med Chem62:4233-4251 (2019) 
 
Cyclin-dependent kinase 4/G1/S-specific cyclin-D1
Name:Cyclin-dependent kinase 4/G1/S-specific cyclin-D1
Type:Protein Complex
Mol. Mass.:n/a
Description:CDK4/D1 complexes were purified from insect cells co-infected with baculovirus vectors containing each of the components.
Components:This complex has 2 components.
Component 1
Name:Cyclin-dependent kinase 4
Synonyms:CDK4 Cell division protein kinase 4 PSK-J3
Type:Enzyme Subunit
Mol. Mass.:33731.96
Organism:Homo sapiens (Human)
Description:P11802
Residue:303
Component 2
Name:G1/S-specific cyclin-D1
Synonyms:B-cell lymphoma 1 protein BCL-1 oncogene CCND1 PRAD1 | PRAD1 oncogene
Type:Enzyme Subunit
Mol. Mass.:33717.70
Organism:Homo sapiens (Human)
Description:n/a
Residue:295
BDBM50433369
NameBDBM50433369
Synonyms:CHEMBL2377825
TypeSmall organic molecule
Emp. Form.C16H13N5O5S2
Mol. Mass.419.435
SMILESNc1nc(Nc2ccc(cc2)S(N)(=O)=O)sc1C(=O)c1ccccc1[N+]([O-])=O