Reaction Details
TargetTransient receptor potential cation channel subfamily A member 1
LigandBDBM13066
Substrate/Competitorn/a
Meas. Tech.ChEMBL_1846734 (CHEMBL4347275)
EC50 63096±n/a nM
Citation Chandrabalan, AMcPhillie, MJMorice, AHBoa, ANSadofsky, LR N-Cinnamoylanthranilates as human TRPA1 modulators: Structure-activity relationships and channel binding sites. Eur J Med Chem170:141-156 (2019) 
 
Transient receptor potential cation channel subfamily A member 1
Name:Transient receptor potential cation channel subfamily A member 1
Type:Protein
Mol. Mass.:127514.20
Organism:Homo sapiens (Human)
Description:O75762
Residue:1119
BDBM13066
NameBDBM13066
Synonyms:2-{2-[(2,6-dichlorophenyl)amino]phenyl}acetic acid Diclofenac US11478464, Compound Diclofenac {2-[(2,6-dichlorophenyl)amino]phenyl}acetic acid
TypeSmall organic molecule
Emp. Form.C14H11Cl2NO2
Mol. Mass.296.149
SMILESOC(=O)Cc1ccccc1Nc1c(Cl)cccc1Cl