Reaction Details
TargetPeptidyl-prolyl cis-trans isomerase FKBP1A
LigandBDBM50067007
Substrate/Competitorn/a
Meas. Tech.ChEMBL_195890 (CHEMBL804190)
Ki 42±n/a nM
Citation Lamb, MLJorgensen, WL Investigations of neurotrophic inhibitors of FK506 binding protein via Monte Carlo simulations. J Med Chem41:3928-39 (1998) 
 
Peptidyl-prolyl cis-trans isomerase FKBP1A
Name:Peptidyl-prolyl cis-trans isomerase FKBP1A
Type:Isomerase
Mol. Mass.:11953.09
Organism:Homo sapiens (Human)
Description:P62942
Residue:108
BDBM50067007
NameBDBM50067007
Synonyms:(S)-1-(3,3-Dimethyl-2-oxo-pentanoyl)-pyrrolidine-2-carboxylic acid 3-phenyl-propyl ester | CHEMBL338562
TypeSmall organic molecule
Emp. Form.C21H29NO4
Mol. Mass.359.4593
SMILESCCC(C)(C)C(=O)C(=O)N1CCC[C@H]1C(=O)OCCCc1ccccc1