Reaction Details
TargetAldo-keto reductase family 1 member B1
LigandBDBM50067387
Substrate/Competitorn/a
Meas. Tech.ChEMBL_31797 (CHEMBL643203)
IC50 72.0±n/a nM
Citation Negoro, TMurata, MUeda, SFujitani, BOno, YKuromiya, AKomiya, MSuzuki, KMatsumoto, J Novel, highly potent aldose reductase inhibitors: (R)-(-)-2-(4-bromo-2-fluorobenzyl)-1,2,3,4- tetrahydropyrrolo[1,2-a]pyrazine -4-spiro-3'-pyrrolidine-1,2',3,5'-tetrone (AS-3201) and its congeners. J Med Chem41:4118-29 (1998) 
 
Aldo-keto reductase family 1 member B1
Name:Aldo-keto reductase family 1 member B1
Type:PROTEIN
Mol. Mass.:35865.31
Organism:Sus scrofa
Description:ChEMBL_502637
Residue:316
BDBM50067387
NameBDBM50067387
Synonyms:2'-(2,4-difluorobenzyl)spiro[tetrahydro-1H-pyrrole-3,4'-(1',2',3',4'-tetrahydropyrrolo[1,2-a]pyrazine)]-1',2,3',5-tetraone | CHEMBL435190
TypeSmall organic molecule
Emp. Form.C17H11F2N3O4
Mol. Mass.359.2837
SMILESFc1ccc(CN2C(=O)c3cccn3C3(CC(=O)NC3=O)C2=O)c(F)c1