Reaction Details
TargetAldo-keto reductase family 1 member B1
LigandBDBM50067392
Substrate/Competitorn/a
Meas. Tech.ChEMBL_31797 (CHEMBL643203)
IC50 165±n/a nM
Citation Negoro, TMurata, MUeda, SFujitani, BOno, YKuromiya, AKomiya, MSuzuki, KMatsumoto, J Novel, highly potent aldose reductase inhibitors: (R)-(-)-2-(4-bromo-2-fluorobenzyl)-1,2,3,4- tetrahydropyrrolo[1,2-a]pyrazine -4-spiro-3'-pyrrolidine-1,2',3,5'-tetrone (AS-3201) and its congeners. J Med Chem41:4118-29 (1998) 
 
Aldo-keto reductase family 1 member B1
Name:Aldo-keto reductase family 1 member B1
Type:PROTEIN
Mol. Mass.:35865.31
Organism:Sus scrofa
Description:ChEMBL_502637
Residue:316
BDBM50067392
NameBDBM50067392
Synonyms:CHEMBL134089 | [2-(4-Bromo-2-fluoro-benzyl)-1,3-dioxo-1,2,3,4-tetrahydro-pyrrolo[1,2-a]pyrazin-4-yl]-acetic acid
TypeSmall organic molecule
Emp. Form.C16H12BrFN2O4
Mol. Mass.395.18
SMILESOC(=O)CC1C(=O)N(Cc2ccc(Br)cc2F)C(=O)c2cccn12