Reaction Details
TargetVoltage-dependent L-type calcium channel subunit alpha-1C
LigandBDBM50067625
Substrate/Competitorn/a
Meas. Tech.ChEMBL_177783 (CHEMBL785241)
IC50 760±n/a nM
Citation Kato, TOzaki, TTamura, KSuzuki, YAkima, MOhi, N Novel calcium antagonists with both calcium overload inhibition and antioxidant activity. 1. 2-(3, 5-di-tert-butyl-4-hydroxyphenyl)-3-(aminopropyl)thiazolidinones. J Med Chem41:4309-16 (1998) 
 
Voltage-dependent L-type calcium channel subunit alpha-1C
Name:Voltage-dependent L-type calcium channel subunit alpha-1C
Type:Enzyme Catalytic Domain
Mol. Mass.:243492.26
Organism:RAT
Description:Calcium channel 0 RAT::P22002
Residue:2169
BDBM50067625
NameBDBM50067625
Synonyms:Benzothiazol-2-yl-{1-[4-(4-fluoro-phenoxy)-butyl]-piperidin-4-yl}-methyl-amine R-56865
TypeSmall organic molecule
Emp. Form.C23H28FN3OS
Mol. Mass.413.551
SMILESCN(C1CCN(CCCCOc2ccc(F)cc2)CC1)c1nc2ccccc2s1