Reaction Details
TargetVoltage-dependent L-type calcium channel subunit alpha-1C
LigandBDBM50067631
Substrate/Competitorn/a
Meas. Tech.ChEMBL_177783 (CHEMBL785241)
IC50 62±n/a nM
Citation Kato, TOzaki, TTamura, KSuzuki, YAkima, MOhi, N Novel calcium antagonists with both calcium overload inhibition and antioxidant activity. 1. 2-(3, 5-di-tert-butyl-4-hydroxyphenyl)-3-(aminopropyl)thiazolidinones. J Med Chem41:4309-16 (1998) 
 
Voltage-dependent L-type calcium channel subunit alpha-1C
Name:Voltage-dependent L-type calcium channel subunit alpha-1C
Type:Enzyme Catalytic Domain
Mol. Mass.:243492.26
Organism:RAT
Description:Calcium channel 0 RAT::P22002
Residue:2169
BDBM50067631
NameBDBM50067631
Synonyms:3-(3-{[2-(Benzo[1,3]dioxol-5-yloxy)-ethyl]-methyl-amino}-propyl)-2-(3,5-di-tert-butyl-4-hydroxy-phenyl)-thiazolidin-4-one | CHEMBL107949
TypeSmall organic molecule
Emp. Form.C30H42N2O5S
Mol. Mass.542.73
SMILESCN(CCCN1C(SCC1=O)c1cc(c(O)c(c1)C(C)(C)C)C(C)(C)C)CCOc1ccc2OCOc2c1