Reaction Details
TargetVoltage-dependent L-type calcium channel subunit alpha-1C
LigandBDBM50067637
Substrate/Competitorn/a
Meas. Tech.ChEMBL_177783 (CHEMBL785241)
IC50 230±n/a nM
Citation Kato, TOzaki, TTamura, KSuzuki, YAkima, MOhi, N Novel calcium antagonists with both calcium overload inhibition and antioxidant activity. 1. 2-(3, 5-di-tert-butyl-4-hydroxyphenyl)-3-(aminopropyl)thiazolidinones. J Med Chem41:4309-16 (1998) 
 
Voltage-dependent L-type calcium channel subunit alpha-1C
Name:Voltage-dependent L-type calcium channel subunit alpha-1C
Type:Enzyme Catalytic Domain
Mol. Mass.:243492.26
Organism:RAT
Description:Calcium channel 0 RAT::P22002
Residue:2169
BDBM50067637
NameBDBM50067637
Synonyms:2-(3,5-Di-tert-butyl-4-hydroxy-phenyl)-3-(3-{[2-(4-methoxy-phenoxy)-ethyl]-methyl-amino}-propyl)-thiazolidin-4-one | CHEMBL137172
TypeSmall organic molecule
Emp. Form.C30H44N2O4S
Mol. Mass.528.746
SMILESCOc1ccc(OCCN(C)CCCN2C(SCC2=O)c2cc(c(O)c(c2)C(C)(C)C)C(C)(C)C)cc1