Reaction Details
TargetM-phase inducer phosphatase 1
LigandBDBM50068037
Substrate/Competitorn/a
Meas. Tech.ChEMBL_40088 (CHEMBL655757)
IC50 4000±n/a nM
Citation Peng, HZalkow, LHAbraham, RTPowis, G Novel CDC25A phosphatase inhibitors from pyrolysis of 3-alpha-azido-B-homo-6-oxa-4-cholesten-7-one on silica gel. J Med Chem41:4677-80 (1998) 
 
M-phase inducer phosphatase 1
Name:M-phase inducer phosphatase 1
Type:Protein
Mol. Mass.:59090.18
Organism:Homo sapiens (Human)
Description:P30304
Residue:524
BDBM50068037
NameBDBM50068037
Synonyms:5-(Benzoyl-{2-[(2,5-diphenyl-oxazole-4-carbonyl)-amino]-ethyl}-amino)-2-decanoylamino-5-oxo-pentanoic acid | CHEMBL143584
TypeSmall organic molecule
Emp. Form.C40H46N4O7
Mol. Mass.694.8158
SMILESCCCCCCCCCC(=O)NC(CCC(=O)N(CCNC(=O)c1nc(oc1-c1ccccc1)-c1ccccc1)C(=O)c1ccccc1)C(O)=O