Reaction Details
TargetSerine/threonine-protein kinase ATR
LigandBDBM50513178
Substrate/Competitorn/a
Meas. Tech.ChEMBL_1852126 (CHEMBL4352750)
Ki 1.000000±n/a nM
Citation Knegtel, RCharrier, JDDurrant, SDavis, CO'Donnell, MStorck, PMacCormick, SKay, DPinder, JVirani, ATwin, HGriffiths, MReaper, PLittlewood, PYoung, SGolec, JPollard, J Rational Design of 5-(4-(Isopropylsulfonyl)phenyl)-3-(3-(4-((methylamino)methyl)phenyl)isoxazol-5-yl)pyrazin-2-amine (VX-970, M6620): Optimization of Intra- and Intermolecular Polar Interactions of a New Ataxia Telangiectasia Mutated and Rad3-Related (ATR) Kinase Inhibitor. J Med Chem62:5547-5561 (2019) 
 
Serine/threonine-protein kinase ATR
Name:Serine/threonine-protein kinase ATR
Type:Protein
Mol. Mass.:301404.58
Organism:Homo sapiens (Human)
Description:Q13535
Residue:2644
BDBM50513178
NameBDBM50513178
Synonyms:CHEMBL4434665
TypeSmall organic molecule
Emp. Form.C21H19N5O2S2
Mol. Mass.437.538
SMILESCC(C)S(=O)(=O)c1ccc(cc1)-c1cnc(N)c(n1)-c1nnc(s1)-c1ccccc1