Reaction Details
TargetDNA-dependent protein kinase catalytic subunit
LigandBDBM50513175
Substrate/Competitorn/a
Meas. Tech.ChEMBL_1852128 (CHEMBL4352752)
Ki>4000±n/a nM
Citation Knegtel, RCharrier, JDDurrant, SDavis, CO'Donnell, MStorck, PMacCormick, SKay, DPinder, JVirani, ATwin, HGriffiths, MReaper, PLittlewood, PYoung, SGolec, JPollard, J Rational Design of 5-(4-(Isopropylsulfonyl)phenyl)-3-(3-(4-((methylamino)methyl)phenyl)isoxazol-5-yl)pyrazin-2-amine (VX-970, M6620): Optimization of Intra- and Intermolecular Polar Interactions of a New Ataxia Telangiectasia Mutated and Rad3-Related (ATR) Kinase Inhibitor. J Med Chem62:5547-5561 (2019) 
 
DNA-dependent protein kinase catalytic subunit
Name:DNA-dependent protein kinase catalytic subunit
Type:Protein
Mol. Mass.:469114.78
Organism:Homo sapiens (Human)
Description:P78527
Residue:4128
BDBM50513175
NameBDBM50513175
Synonyms:CHEMBL4530813
TypeSmall organic molecule
Emp. Form.C22H20N4O3S
Mol. Mass.420.484
SMILESCC(C)S(=O)(=O)c1ccc(cc1)-c1cnc(N)c(n1)-c1cc(on1)-c1ccccc1