Reaction Details
TargetSerine/threonine-protein kinase ATR
LigandBDBM50513172
Substrate/Competitorn/a
Meas. Tech.ChEMBL_1852126 (CHEMBL4352750)
Ki 1.2±n/a nM
Citation Knegtel, RCharrier, JDDurrant, SDavis, CO'Donnell, MStorck, PMacCormick, SKay, DPinder, JVirani, ATwin, HGriffiths, MReaper, PLittlewood, PYoung, SGolec, JPollard, J Rational Design of 5-(4-(Isopropylsulfonyl)phenyl)-3-(3-(4-((methylamino)methyl)phenyl)isoxazol-5-yl)pyrazin-2-amine (VX-970, M6620): Optimization of Intra- and Intermolecular Polar Interactions of a New Ataxia Telangiectasia Mutated and Rad3-Related (ATR) Kinase Inhibitor. J Med Chem62:5547-5561 (2019) 
 
Serine/threonine-protein kinase ATR
Name:Serine/threonine-protein kinase ATR
Type:Protein
Mol. Mass.:301404.58
Organism:Homo sapiens (Human)
Description:Q13535
Residue:2644
BDBM50513172
NameBDBM50513172
Synonyms:CHEMBL4467848
TypeSmall organic molecule
Emp. Form.C24H25N5O3S
Mol. Mass.463.552
SMILESCC(C)S(=O)(=O)c1ccc(cc1)-c1cnc(N)c(n1)-c1cc(no1)-c1ccc(cc1)[C@H](C)N