Reaction Details
TargetDNA-dependent protein kinase catalytic subunit
LigandBDBM420860
Substrate/Competitorn/a
Meas. Tech.ChEMBL_1852128 (CHEMBL4352752)
Ki>4000±n/a nM
Citation Knegtel, RCharrier, JDDurrant, SDavis, CO'Donnell, MStorck, PMacCormick, SKay, DPinder, JVirani, ATwin, HGriffiths, MReaper, PLittlewood, PYoung, SGolec, JPollard, J Rational Design of 5-(4-(Isopropylsulfonyl)phenyl)-3-(3-(4-((methylamino)methyl)phenyl)isoxazol-5-yl)pyrazin-2-amine (VX-970, M6620): Optimization of Intra- and Intermolecular Polar Interactions of a New Ataxia Telangiectasia Mutated and Rad3-Related (ATR) Kinase Inhibitor. J Med Chem62:5547-5561 (2019) 
 
DNA-dependent protein kinase catalytic subunit
Name:DNA-dependent protein kinase catalytic subunit
Type:Protein
Mol. Mass.:469114.78
Organism:Homo sapiens (Human)
Description:P78527
Residue:4128
BDBM420860
NameBDBM420860
Synonyms:US10479784, Compound IIA-13 | US10961232, Compound IIA-13
TypeSmall organic molecule
Emp. Form.C24H24ClN5O3S
Mol. Mass.497.997
SMILESCNCc1ccc(cc1Cl)-c1cc(on1)-c1nc(cnc1N)-c1ccc(cc1)S(=O)(=O)C(C)C