Reaction Details
TargetAlpha-1B adrenergic receptor
LigandBDBM50068820
Substrate/Competitorn/a
Meas. Tech.ChEMBL_34639 (CHEMBL647284)
Ki 45000±n/a nM
Citation Nagarathnam, DWetzel, JMMiao, SWMarzabadi, MRChiu, GWong, WCHong, XFang, JForray, CBranchek, TAHeydorn, WEChang, RSBroten, TSchorn, TWGluchowski, C Design and synthesis of novel alpha1a adrenoceptor-selective dihydropyridine antagonists for the treatment of benign prostatic hyperplasia. J Med Chem41:5320-33 (1999) 
 
Alpha-1B adrenergic receptor
Name:Alpha-1B adrenergic receptor
Type:Enzyme
Mol. Mass.:56862.13
Organism:Homo sapiens (Human)
Description:P35368
Residue:520
BDBM50068820
NameBDBM50068820
Synonyms:2,6-Dimethyl-4-(4-nitro-phenyl)-1,4-dihydro-pyridine-3,5-dicarboxylic acid 3-{[3-(4-dimethylaminomethyl-4-phenyl-piperidin-1-yl)-propyl]-amide} 5-methylamide | CHEMBL356923
TypeSmall organic molecule
Emp. Form.C33H44N6O4
Mol. Mass.588.7403
SMILESCNC(=O)C1C(C(C(=O)NCCCN2CCC(CN(C)C)(CC2)c2ccccc2)=C(C)N=C1C)c1ccc(cc1)[N+]([O-])=O