Reaction Details
TargetAlpha-1A adrenergic receptor
LigandBDBM50068814
Substrate/Competitorn/a
Meas. Tech.ChEMBL_33615 (CHEMBL652822)
Ki 4.17±n/a nM
Citation Nagarathnam, DWetzel, JMMiao, SWMarzabadi, MRChiu, GWong, WCHong, XFang, JForray, CBranchek, TAHeydorn, WEChang, RSBroten, TSchorn, TWGluchowski, C Design and synthesis of novel alpha1a adrenoceptor-selective dihydropyridine antagonists for the treatment of benign prostatic hyperplasia. J Med Chem41:5320-33 (1999) 
 
Alpha-1A adrenergic receptor
Name:Alpha-1A adrenergic receptor
Type:Cell-surface receptors
Mol. Mass.:51511.67
Organism:Homo sapiens (Human)
Description:P35348
Residue:466
BDBM50068814
NameBDBM50068814
Synonyms:1-{3-[(5-Acetyl-4-benzo[1,3]dioxol-5-yl-2,6-dimethyl-1,4-dihydro-pyridine-3-carbonyl)-amino]-propyl}-4-phenyl-piperidine-4-carboxylic acid methyl ester | CHEMBL148552
TypeSmall organic molecule
Emp. Form.C33H39N3O6
Mol. Mass.573.6793
SMILESCOC(=O)C1(CCN(CCCNC(=O)C2=C(C)N=C(C)C(C2c2ccc3OCOc3c2)C(C)=O)CC1)c1ccccc1