Reaction Details
Target5-hydroxytryptamine receptor 1D
LigandBDBM50068832
Substrate/Competitorn/a
Meas. Tech.ChEMBL_32426 (CHEMBL646088)
Ki 630±n/a nM
Citation Nagarathnam, DWetzel, JMMiao, SWMarzabadi, MRChiu, GWong, WCHong, XFang, JForray, CBranchek, TAHeydorn, WEChang, RSBroten, TSchorn, TWGluchowski, C Design and synthesis of novel alpha1a adrenoceptor-selective dihydropyridine antagonists for the treatment of benign prostatic hyperplasia. J Med Chem41:5320-33 (1999) 
 
5-hydroxytryptamine receptor 1D
Name:5-hydroxytryptamine receptor 1D
Type:G Protein-Coupled Receptor (GPCR)
Mol. Mass.:41920.63
Organism:Homo sapiens (Human)
Description:Receptor binding assays were performed using human clone stably expressed in CHO cells.
Residue:377
BDBM50068832
NameBDBM50068832
Synonyms:2,6-Dimethyl-4-(4-nitro-phenyl)-1,4-dihydro-pyridine-3,5-dicarboxylic acid 3-methylamide 5-{[3-(4-phenyl-piperidin-1-yl)-propyl]-amide} | CHEMBL358253
TypeSmall organic molecule
Emp. Form.C30H37N5O4
Mol. Mass.531.6459
SMILESCNC(=O)C1C(C(C(=O)NCCCN2CCC(CC2)c2ccccc2)=C(C)N=C1C)c1ccc(cc1)[N+]([O-])=O