Reaction Details
TargetCaspase-1
LigandBDBM50068962
Substrate/Competitorn/a
Meas. Tech.ChEBML_90979
Ki 3.1±n/a nM
Citation Semple, GAshworth, DMBatt, ARBaxter, AJBenzies, DWElliot, LHEvans, DMFranklin, RJHudson, PJenkins, PDPitt, GRRooker, DPYamamoto, SIsomura, Y Peptidomimetic aminomethylene ketone inhibitors of interleukin-1 beta-converting enzyme (ICE). Bioorg Med Chem Lett8:959-64 (1999) Caspase-1
Name:Caspase-1
Type:Enzyme
Mol. Mass.:45154.13
Organism:Homo sapiens (Human)
Description:P29466
Residue:404
BDBM50068962
NameBDBM50068962
Synonyms:(S)-5-(Butyl-methyl-amino)-3-(2-{3-[(naphthalene-2-carbonyl)-amino]-2-oxo-2H-pyridin-1-yl}-butyrylamino)-4-oxo-pentanoic acid | CHEMBL173677
TypeSmall organic molecule
Emp. Form.C30H36N4O6
Mol. Mass.548.63
SMILESCCCCN(C)CC(=O)[C@H](CC(O)=O)NC(=O)C(CC)n1cccc(NC(=O)c2ccc3ccccc3c2)c1=O