Reaction Details
TargetCysteinyl leukotriene receptor 1/2
LigandBDBM50215372
Substrate/Competitorn/a
Meas. Tech.ChEMBL_99997 (CHEMBL710522)
IC50 1.4±n/a nM
Citation von Sprecher, AGerspacher, MBeck, AKimmel, SWiestner, HAnderson, GPNiederhauser, USubramanian, NBray, MA Synthesis and SAR of a novel, potent and structurally simple LTD4 antagonist of the quinoline class. Bioorg Med Chem Lett8:965-70 (1999) Cysteinyl leukotriene receptor 1/2
Name:Cysteinyl leukotriene receptor 1/2
Synonyms:Cysteinyl leukotriene receptor
Type:n/a
Mol. Mass.:n/a
Description:ASSAY_ID of ChEMBL is 98640
Components:This complex has 2 components.
Component 1
Name:Cysteinyl leukotriene receptor 1
Type:Enzyme Catalytic Domain
Mol. Mass.:38565.16
Organism:Homo sapiens (Human)
Description:Leukotriene Cysteinyl 1 CYSLTR1 HUMAN::Q9Y271
Residue:337
Component 2
Name:Cysteinyl leukotriene receptor 2
Synonyms:CLTR2_HUMAN CYSLT2R Cysteinyl leukotriene receptor Leukotriene Cysteinyl 2
Type:Enzyme Catalytic Domain
Mol. Mass.:39657.52
Organism:Homo sapiens (Human)
Description:Leukotriene Cysteinyl 2 CYSLTR2 HUMAN::Q9NS75
Residue:346
BDBM50215372
NameBDBM50215372
Synonyms:CHEMBL175419
TypeSmall organic molecule
Emp. Form.C22H21FN2O4
Mol. Mass.396.4115
SMILESCC(C)(CC(=O)Nc1cccc(OCc2ccc3ccc(F)cc3n2)c1)C(O)=O