Reaction Details
TargetD(1A) dopamine receptor
LigandBDBM50069016
Substrate/Competitorn/a
Meas. Tech.ChEBML_58646
Ki 2.8±n/a nM
Citation Maryanoff, BEMcComsey, DFMartin, GEShank, RP Azepinoindole derivatives with high affinity for brain dopamine and serotonin receptors. Bioorg Med Chem Lett8:983-8 (1999) D(1A) dopamine receptor
Name:D(1A) dopamine receptor
Type:Enzyme Catalytic Domain
Mol. Mass.:49429.75
Organism:RAT
Description:P18901
Residue:446
BDBM50069016
NameBDBM50069016
Synonyms:1-(4-Fluoro-phenyl)-4-methyl-2,2a,3,4,5,6-hexahydro-1H-azepino[3,4,5-cd]indole | CHEMBL173315
TypeSmall organic molecule
Emp. Form.C18H19FN2
Mol. Mass.282.3553
SMILESCN1CCc2cccc3N(CC(C1)c23)c1ccc(F)cc1