Reaction Details
TargetD(2) dopamine receptor
LigandBDBM50069013
Substrate/Competitorn/a
Meas. Tech.ChEBML_62390
Ki 3±n/a nM
Citation Maryanoff, BEMcComsey, DFMartin, GEShank, RP Azepinoindole derivatives with high affinity for brain dopamine and serotonin receptors. Bioorg Med Chem Lett8:983-8 (1999) D(2) dopamine receptor
Name:D(2) dopamine receptor
Type:G Protein-Coupled Receptor (GPCR)
Mol. Mass.:50931.60
Organism:Rattus norvegicus (rat)
Description:P61169
Residue:444
BDBM50069013
NameBDBM50069013
Synonyms:CHEMBL171903 | [1-(4-Fluoro-phenyl)-4-methyl-2,3-dihydro-1H-indol-3-ylmethyl]-dimethyl-amine
TypeSmall organic molecule
Emp. Form.C18H21FN2
Mol. Mass.284.3711
SMILESCN(C)CC1CN(c2cccc(C)c12)c1ccc(F)cc1