Reaction Details
TargetAlpha-1A/Alpha-1B/Alpha-1D adrenergic receptor
LigandBDBM50069016
Substrate/Competitorn/a
Meas. Tech.ChEMBL_34581 (CHEMBL645391)
Ki 4.7±n/a nM
Citation Maryanoff, BEMcComsey, DFMartin, GEShank, RP Azepinoindole derivatives with high affinity for brain dopamine and serotonin receptors. Bioorg Med Chem Lett8:983-8 (1999) Alpha-1A/Alpha-1B/Alpha-1D adrenergic receptor
Name:Alpha-1A/Alpha-1B/Alpha-1D adrenergic receptor
Type:n/a
Mol. Mass.:n/a
Description:ASSAY_ID of EBI is 303470
Components:This complex has 3 components.
Component 1
Name:Alpha-1B adrenergic receptor
Synonyms:ADA1B_RAT Alpha 1B-adrenoceptor Alpha adrenergic receptor 1A and 1B Alpha-1Adrenoceptor Alpha-1B adrenoreceptor | adrenergic Alpha1B
Type:G Protein-Coupled Receptor (GPCR)
Mol. Mass.:56606.71
Organism:Rattus norvegicus (rat)
Description:Receptor binding assays were performed using rat cortical membranes.
Residue:515
Component 2
Name:Alpha-1A adrenergic receptor
Synonyms:ADA1A_RAT Adra1c Alpha-1A adrenoceptor Alpha-1C adrenergic receptor | adrenergic Alpha1A
Type:Protein
Mol. Mass.:51620.15
Organism:Rattus norvegicus (Rat)
Description:P43140
Residue:466
Component 3
Name:Alpha-1D adrenergic receptor
Synonyms:ADA1D_RAT Adra1d Alpha-1D adrenergic receptor | Serotonin 1a (5-HT1a) receptor/Adrenergic receptor alpha-1
Type:Protein
Mol. Mass.:59375.97
Organism:Rattus norvegicus (Rat)
Description:P23944
Residue:561
BDBM50069016
NameBDBM50069016
Synonyms:1-(4-Fluoro-phenyl)-4-methyl-2,2a,3,4,5,6-hexahydro-1H-azepino[3,4,5-cd]indole | CHEMBL173315
TypeSmall organic molecule
Emp. Form.C18H19FN2
Mol. Mass.282.3553
SMILESCN1CCc2cccc3N(CC(C1)c23)c1ccc(F)cc1