Reaction Details
TargetAlpha-1A/Alpha-1B/Alpha-1D adrenergic receptor
LigandBDBM50001885
Substrate/Competitorn/a
Meas. Tech.ChEMBL_34585 (CHEMBL645395)
Ki 3±n/a nM
Citation Maryanoff, BEMcComsey, DFMartin, GEShank, RP Azepinoindole derivatives with high affinity for brain dopamine and serotonin receptors. Bioorg Med Chem Lett8:983-8 (1999) Alpha-1A/Alpha-1B/Alpha-1D adrenergic receptor
Name:Alpha-1A/Alpha-1B/Alpha-1D adrenergic receptor
Type:n/a
Mol. Mass.:n/a
Description:ASSAY_ID of EBI is 303470
Components:This complex has 3 components.
Component 1
Name:Alpha-1B adrenergic receptor
Synonyms:ADA1B_RAT Alpha 1B-adrenoceptor Alpha adrenergic receptor 1A and 1B Alpha-1Adrenoceptor Alpha-1B adrenoreceptor | adrenergic Alpha1B
Type:G Protein-Coupled Receptor (GPCR)
Mol. Mass.:56606.71
Organism:Rattus norvegicus (rat)
Description:Receptor binding assays were performed using rat cortical membranes.
Residue:515
Component 2
Name:Alpha-1A adrenergic receptor
Synonyms:ADA1A_RAT Adra1c Alpha-1A adrenoceptor Alpha-1C adrenergic receptor | adrenergic Alpha1A
Type:Protein
Mol. Mass.:51620.15
Organism:Rattus norvegicus (Rat)
Description:P43140
Residue:466
Component 3
Name:Alpha-1D adrenergic receptor
Synonyms:ADA1D_RAT Adra1d Alpha-1D adrenergic receptor | Serotonin 1a (5-HT1a) receptor/Adrenergic receptor alpha-1
Type:Protein
Mol. Mass.:59375.97
Organism:Rattus norvegicus (Rat)
Description:P23944
Residue:561
BDBM50001885
NameBDBM50001885
Synonyms:(risperidone)3-{2-[4-(6-Fluoro-benzo[d]isoxazol-3-yl)-piperidin-1-yl]-ethyl}-2-methyl-6,7,8,9-tetrahydro-pyrido[1,2-a]pyrimidin-4-one 2-(2-(4-(benzo[d]isoxazol-3-yl)piperidin-1-yl)ethyl)-7,8,9,9a-tetrahydro-1H-pyrido[1,2-a]pyrimidin-4(6H)-one 3-(2-(4-(6-fluorobenzo[d]isoxazol-3-yl)piperidin-1-yl)ethyl)-2-methyl-6,7,8,9-tetrahydropyrido[1,2-a]pyrimidin-4-one 3-{2-[4-(6-Fluoro-benzo[d]isoxazol-3-yl)-piperidin-1-yl]-ethyl}-2-methyl-6,7,8,9-tetrahydro-pyrido[1,2-a]pyrimidin-4-one (Resperidone) 3-{2-[4-(6-Fluoro-benzo[d]isoxazol-3-yl)-piperidin-1-yl]-ethyl}-2-methyl-6,7,8,9-tetrahydro-pyrido[1,2-a]pyrimidin-4-one(risperidone) CHEMBL85 RISPERDAL US10167256, Risperidone US10259786, Risperidone US8802672, Risperidone | WO2023288027, Cmpd Risperidone
TypeSmall organic molecule
Emp. Form.C23H27FN4O2
Mol. Mass.410.4845
SMILESCc1nc2CCCCn2c(=O)c1CCN1CCC(CC1)c1noc2cc(F)ccc12