Reaction Details
TargetD(2) dopamine receptor
LigandBDBM50069036
Substrate/Competitorn/a
Meas. Tech.ChEMBL_58463 (CHEMBL670394)
Ki 38.0±n/a nM
Citation Sanner, MAChappie, TADunaiskis, ARFliri, AFDesai, KAZorn, SHJackson, ERJohnson, CGMorrone, JMSeymour, PAMajchrzak, MJFaraci, WSCollins, JLDuignan, DBPrete Di, CCLee, JSTrozzi, A Synthesis, SAR and pharmacology of CP-293,019: a potent, selective dopamine D4 receptor antagonist. Bioorg Med Chem Lett8:725-30 (1999) D(2) dopamine receptor
Name:D(2) dopamine receptor
Type:Cell-surface receptors
Mol. Mass.:50647.10
Organism:Homo sapiens (Human)
Description:P14416
Residue:443
BDBM50069036
NameBDBM50069036
Synonyms:(7S,9aS)-7-Phenoxymethyl-2-pyrimidin-2-yl-octahydro-pyrido[1,2-a]pyrazine | CHEMBL165504
TypeSmall organic molecule
Emp. Form.C19H24N4O
Mol. Mass.324.4201
SMILESC(Oc1ccccc1)[C@H]1CC[C@H]2CN(CCN2C1)c1ncccn1