Reaction Details
TargetD(2) dopamine receptor
LigandBDBM50069035
Substrate/Competitorn/a
Meas. Tech.ChEBML_58463
Ki 44±n/a nM
Citation Sanner, MAChappie, TADunaiskis, ARFliri, AFDesai, KAZorn, SHJackson, ERJohnson, CGMorrone, JMSeymour, PAMajchrzak, MJFaraci, WSCollins, JLDuignan, DBPrete Di, CCLee, JSTrozzi, A Synthesis, SAR and pharmacology of CP-293,019: a potent, selective dopamine D4 receptor antagonist. Bioorg Med Chem Lett8:725-30 (1999) D(2) dopamine receptor
Name:D(2) dopamine receptor
Type:Cell-surface receptors
Mol. Mass.:50647.10
Organism:Homo sapiens (Human)
Description:P14416
Residue:443
BDBM50069035
NameBDBM50069035
Synonyms:(7R,9aS)-7-Phenoxymethyl-2-phenyl-octahydro-pyrido[1,2-a]pyrazine | CHEMBL351611
TypeSmall organic molecule
Emp. Form.C21H26N2O
Mol. Mass.322.4439
SMILESC(Oc1ccccc1)[C@@H]1CC[C@H]2CN(CCN2C1)c1ccccc1