Reaction Details
TargetD(2) dopamine receptor
LigandBDBM50069037
Substrate/Competitorn/a
Meas. Tech.ChEBML_58463
Ki 187±n/a nM
Citation Sanner, MAChappie, TADunaiskis, ARFliri, AFDesai, KAZorn, SHJackson, ERJohnson, CGMorrone, JMSeymour, PAMajchrzak, MJFaraci, WSCollins, JLDuignan, DBPrete Di, CCLee, JSTrozzi, A Synthesis, SAR and pharmacology of CP-293,019: a potent, selective dopamine D4 receptor antagonist. Bioorg Med Chem Lett8:725-30 (1999) D(2) dopamine receptor
Name:D(2) dopamine receptor
Type:Cell-surface receptors
Mol. Mass.:50647.10
Organism:Homo sapiens (Human)
Description:P14416
Residue:443
BDBM50069037
NameBDBM50069037
Synonyms:(7R,9aS)-7-Phenoxymethyl-2-pyridin-2-yl-octahydro-pyrido[1,2-a]pyrazine | CHEMBL350160
TypeSmall organic molecule
Emp. Form.C20H25N3O
Mol. Mass.323.432
SMILESC(Oc1ccccc1)[C@@H]1CC[C@H]2CN(CCN2C1)c1ccccn1