Reaction Details
TargetD(4) dopamine receptor
LigandBDBM50069046
Substrate/Competitorn/a
Meas. Tech.ChEBML_58935
Ki 127±n/a nM
Citation Sanner, MAChappie, TADunaiskis, ARFliri, AFDesai, KAZorn, SHJackson, ERJohnson, CGMorrone, JMSeymour, PAMajchrzak, MJFaraci, WSCollins, JLDuignan, DBPrete Di, CCLee, JSTrozzi, A Synthesis, SAR and pharmacology of CP-293,019: a potent, selective dopamine D4 receptor antagonist. Bioorg Med Chem Lett8:725-30 (1999) D(4) dopamine receptor
Name:D(4) dopamine receptor
Type:Enzyme
Mol. Mass.:48373.19
Organism:Homo sapiens (Human)
Description:P21917
Residue:419
BDBM50069046
NameBDBM50069046
Synonyms:4-((7R,9aS)-2-Pyrimidin-2-yl-octahydro-pyrido[1,2-a]pyrazin-7-ylmethoxy)-benzoic acid methyl ester | CHEMBL165113
TypeSmall organic molecule
Emp. Form.C21H26N4O3
Mol. Mass.382.4561
SMILESCOC(=O)c1ccc(OC[C@@H]2CC[C@H]3CN(CCN3C2)c2ncccn2)cc1