Reaction Details
TargetD(2) dopamine receptor
LigandBDBM50069049
Substrate/Competitorn/a
Meas. Tech.ChEBML_58463
Ki 1720±n/a nM
Citation Sanner, MAChappie, TADunaiskis, ARFliri, AFDesai, KAZorn, SHJackson, ERJohnson, CGMorrone, JMSeymour, PAMajchrzak, MJFaraci, WSCollins, JLDuignan, DBPrete Di, CCLee, JSTrozzi, A Synthesis, SAR and pharmacology of CP-293,019: a potent, selective dopamine D4 receptor antagonist. Bioorg Med Chem Lett8:725-30 (1999) D(2) dopamine receptor
Name:D(2) dopamine receptor
Type:Cell-surface receptors
Mol. Mass.:50647.10
Organism:Homo sapiens (Human)
Description:P14416
Residue:443
BDBM50069049
NameBDBM50069049
Synonyms:(7R,9aS)-7-(4-tert-Butyl-phenoxymethyl)-2-pyrimidin-2-yl-octahydro-pyrido[1,2-a]pyrazine | CHEMBL349904
TypeSmall organic molecule
Emp. Form.C23H32N4O
Mol. Mass.380.5264
SMILESCC(C)(C)c1ccc(OC[C@@H]2CC[C@H]3CN(CCN3C2)c2ncccn2)cc1