Reaction Details
TargetPlasmepsin II
LigandBDBM50513809
Substrate/Competitorn/a
Meas. Tech.ChEMBL_1854563 (CHEMBL4355292)
IC50 10.0±n/a nM
Citation Bobrovs, RJaudzems, KJirgensons, A Exploiting Structural Dynamics To Design Open-Flap Inhibitors of Malarial Aspartic Proteases. J Med Chem62:8931-8950 (2019) 
 
Plasmepsin II
Name:Plasmepsin II
Type:Enzyme
Mol. Mass.:51482.09
Organism:Plasmodium falciparum
Description:P46925
Residue:453
BDBM50513809
NameBDBM50513809
Synonyms:CHEMBL4558109
TypeSmall organic molecule
Emp. Form.C38H47N3O3
Mol. Mass.593.7981
SMILESCN(CCc1ccccc1)C(=O)C1=C(CC2CN(CC1N2)C(C)=O)c1ccc(CCOc2ccc(cc2C)C(C)(C)C)cc1