Reaction Details
TargetPlasmepsin II
LigandBDBM50513823
Substrate/Competitorn/a
Meas. Tech.ChEMBL_1854563 (CHEMBL4355292)
IC50 10.0±n/a nM
Citation Bobrovs, RJaudzems, KJirgensons, A Exploiting Structural Dynamics To Design Open-Flap Inhibitors of Malarial Aspartic Proteases. J Med Chem62:8931-8950 (2019) 
 
Plasmepsin II
Name:Plasmepsin II
Type:Enzyme
Mol. Mass.:51482.09
Organism:Plasmodium falciparum
Description:P46925
Residue:453
BDBM50513823
NameBDBM50513823
Synonyms:CHEMBL4517758
TypeSmall organic molecule
Emp. Form.C33H35Cl2N3O3
Mol. Mass.592.555
SMILESCN(CCc1ccccc1)C(=O)C1=C(CC2CN(CC1N2)C(C)=O)c1ccc(CCOc2cc(Cl)ccc2Cl)cc1