Reaction Details
TargetMatrix metalloproteinase-9
LigandBDBM50069224
Substrate/Competitorn/a
Meas. Tech.ChEBML_105373
Ki 1±n/a nM
Citation Jacobson, ICReddy, PGWasserman, ZRHardman, KDCovington, MBArner, ECCopeland, RADecicco, CPMagolda, RL Structure-based design and synthesis of a series of hydroxamic acids with a quaternary-hydroxy group in P1 as inhibitors of matrix metalloproteinases. Bioorg Med Chem Lett8:837-42 (1999) Matrix metalloproteinase-9
Name:Matrix metalloproteinase-9
Type:Enzyme
Mol. Mass.:78452.28
Organism:Homo sapiens (Human)
Description:P14780
Residue:707
BDBM50069224
NameBDBM50069224
Synonyms:(2R,3R)-2,N*1*-Dihydroxy-N*4*-{(S)-1-[((R)-hydroxy-phenyl-methyl)-carbamoyl]-2-phenyl-ethyl}-2-methyl-3-(3-phenyl-propyl)-succinamide | CHEMBL355418
TypeSmall organic molecule
Emp. Form.C30H35N3O6
Mol. Mass.533.6154
SMILESC[C@@](O)([C@@H](CCCc1ccccc1)C(=O)N[C@@H](Cc1ccccc1)C(=O)N[C@H](O)c1ccccc1)C(=O)NO