Reaction Details
TargetStromelysin-1
LigandBDBM50069226
Substrate/Competitorn/a
Meas. Tech.ChEBML_101949
Ki 13±n/a nM
Citation Jacobson, ICReddy, PGWasserman, ZRHardman, KDCovington, MBArner, ECCopeland, RADecicco, CPMagolda, RL Structure-based design and synthesis of a series of hydroxamic acids with a quaternary-hydroxy group in P1 as inhibitors of matrix metalloproteinases. Bioorg Med Chem Lett8:837-42 (1999) Stromelysin-1
Name:Stromelysin-1
Type:Enzyme
Mol. Mass.:53973.13
Organism:Homo sapiens (Human)
Description: P08254
Residue:477
BDBM50069226
NameBDBM50069226
Synonyms:CHEMBL265216 | {(S)-4-[(R)-2-((R)-1-Hydroxy-1-hydroxycarbamoyl-ethyl)-5-phenyl-pentanoylamino]-4-methylcarbamoyl-butyl}-carbamic acid tert-butyl ester
TypeSmall organic molecule
Emp. Form.C25H40N4O7
Mol. Mass.508.6077
SMILESCNC(=O)[C@H](CCCNC(=O)OC(C)(C)C)NC(=O)[C@H](CCCc1ccccc1)[C@@](C)(O)C(=O)NO