Reaction Details
TargetProstaglandin G/H synthase 1
LigandBDBM50056999
Substrate/Competitorn/a
Meas. Tech.ChEBML_158925
IC50 59000±n/a nM
Citation Stewart, KDLoren, SFrey, LOtis, EKlinghofer, VHulkower, KI Discovery of a new cyclooxygenase-2 lead compound through 3-D database searching and combinatorial chemistry. Bioorg Med Chem Lett8:529-34 (1999) Prostaglandin G/H synthase 1
Name:Prostaglandin G/H synthase 1
Type:Enzyme
Mol. Mass.:68692.62
Organism:Homo sapiens (Human)
Description:P23219
Residue:599
BDBM50056999
NameBDBM50056999
Synonyms:CHEMBL56367 | nimesulide
TypeSmall organic molecule
Emp. Form.C13H12N2O5S
Mol. Mass.308.31
SMILESCS(=O)(=O)Nc1ccc(cc1Oc1ccccc1)[N+]([O-])=O