Reaction Details
TargetPlasmepsin II
LigandBDBM50514485
Substrate/Competitorn/a
Meas. Tech.ChEMBL_1856935 (CHEMBL4357664)
IC50 8.0±n/a nM
Citation Cheuka, PMDziwornu, GOkombo, JChibale, K Plasmepsin Inhibitors in Antimalarial Drug Discovery: Medicinal Chemistry and Target Validation (2000 to Present). J Med Chem63:4445-4467 (2020) 
 
Plasmepsin II
Name:Plasmepsin II
Type:Enzyme
Mol. Mass.:51482.09
Organism:Plasmodium falciparum
Description:P46925
Residue:453
BDBM50514485
NameBDBM50514485
Synonyms:CHEMBL4580614
TypeSmall organic molecule
Emp. Form.C36H48N2O2
Mol. Mass.540.7785
SMILESCCCCCc1ccc(cc1)C(=O)N(Cc1ccc(cc1)-c1ccc(OC)cc1)C1CCN(CCC(C)C)CC1