Reaction Details
TargetPlasmepsin II
LigandBDBM50377588
Substrate/Competitorn/a
Meas. Tech.ChEMBL_1856924 (CHEMBL4357653)
IC50 4.0±n/a nM
Citation Cheuka, PMDziwornu, GOkombo, JChibale, K Plasmepsin Inhibitors in Antimalarial Drug Discovery: Medicinal Chemistry and Target Validation (2000 to Present). J Med Chem63:4445-4467 (2020) 
 
Plasmepsin II
Name:Plasmepsin II
Type:Enzyme
Mol. Mass.:51482.09
Organism:Plasmodium falciparum
Description:P46925
Residue:453
BDBM50377588
NameBDBM50377588
Synonyms:CHEMBL257594
TypeSmall organic molecule
Emp. Form.C22H19N3O2
Mol. Mass.357.4052
SMILESCc1ccc2c(NNC(=O)c3ccccc3O)c3ccccc3nc2c1C