Reaction Details
TargetKynureninase
LigandBDBM50069730
Substrate/Competitorn/a
Meas. Tech.ChEBML_91722
Ki 70.0±n/a nM
Citation Drysdale, MJReinhard, JF S-aryl cysteine S,S-dioxides as inhibitors of mammalian kynureninase. Bioorg Med Chem Lett8:133-8 (1999) Kynureninase
Name:Kynureninase
Type:PROTEIN
Mol. Mass.:52356.52
Organism:Homo sapiens (Human)
Description:ChEMBL_91729
Residue:465
BDBM50069730
NameBDBM50069730
Synonyms:2-Amino-3-(2-amino-benzenesulfonyl)-propionic acid | CHEMBL280572
TypeSmall organic molecule
Emp. Form.C9H12N2O4S
Mol. Mass.244.268
SMILESNC(CS(=O)(=O)c1ccccc1N)C(O)=O