Reaction Details
TargetKynureninase
LigandBDBM50069731
Substrate/Competitorn/a
Meas. Tech.ChEMBL_91725 (CHEMBL702023)
IC50 20000±n/a nM
Citation Drysdale, MJReinhard, JF S-aryl cysteine S,S-dioxides as inhibitors of mammalian kynureninase. Bioorg Med Chem Lett8:133-8 (1999) Kynureninase
Name:Kynureninase
Type:PROTEIN
Mol. Mass.:52470.50
Organism:Rattus norvegicus
Description:ChEMBL_91725
Residue:464
BDBM50069731
NameBDBM50069731
Synonyms:2-Amino-3-(2-amino-3-fluoro-benzenesulfonyl)-propionic acid | CHEMBL29137
TypeSmall organic molecule
Emp. Form.C9H11FN2O4S
Mol. Mass.262.258
SMILESNC(CS(=O)(=O)c1cccc(F)c1N)C(O)=O