Reaction Details
TargetNeuronal acetylcholine receptor subunit alpha-4/beta-2
LigandBDBM50069838
Substrate/Competitorn/a
Meas. Tech.ChEMBL_223086 (CHEMBL841329)
Ki 35±n/a nM
Citation Lin, NHGunn, DELi, YHe, YBai, HRyther, KBKuntzweiler, TDonnelly-Roberts, DLAnderson, DJCampbell, JESullivan, JPArneric, SPHolladay, MW Synthesis and structure-activity relationships of pyridine-modified analogs of 3-[2-((S)-pyrrolidinyl)methoxy]pyridine, A-84543, a potent nicotinic acetylcholine receptor agonist. Bioorg Med Chem Lett8:249-54 (1999) Neuronal acetylcholine receptor subunit alpha-4/beta-2
Name:Neuronal acetylcholine receptor subunit alpha-4/beta-2
Type:n/a
Mol. Mass.:n/a
Description:n/a
Components:This complex has 0 components.
Component 1
Name:Neuronal acetylcholine receptor subunit alpha-4
Synonyms:ACHA4_RAT Cholinergic, Nicotinic Alpha4Beta2 Chrna4 Neuronal acetylcholine receptor (alpha4beta2 nAChR) Neuronal acetylcholine receptor subunit alpha 4 beta 2 | Neuronal acetylcholine receptor subunit alpha-4
Type:Enzyme
Mol. Mass.:70196.44
Organism:Rattus norvegicus (Rat)
Description:P09483
Residue:630
Component 2
Name:Neuronal acetylcholine receptor subunit beta-2
Synonyms:ACHB2_RAT Chrnb2 Neuronal acetylcholine receptor non-alpha-1 chain
Type:Enzyme
Mol. Mass.:56910.32
Organism:Rattus norvegicus (Rat)
Description:P12390
Residue:500
BDBM50069838
NameBDBM50069838
Synonyms:3-Bromo-5-((S)-1-methyl-pyrrolidin-2-ylmethoxy)-pyridine 1-oxide | CHEMBL84936
TypeSmall organic molecule
Emp. Form.C11H15BrN2O2
Mol. Mass.287.153
SMILESCN1CCC[C@H]1COc1cc(Br)c[n+]([O-])c1