Reaction Details
TargetNeuronal acetylcholine receptor subunit alpha-4/beta-2
LigandBDBM50069840
Substrate/Competitorn/a
Meas. Tech.ChEMBL_223078 (CHEMBL842926)
EC50 2600±n/a nM
Citation Lin, NHGunn, DELi, YHe, YBai, HRyther, KBKuntzweiler, TDonnelly-Roberts, DLAnderson, DJCampbell, JESullivan, JPArneric, SPHolladay, MW Synthesis and structure-activity relationships of pyridine-modified analogs of 3-[2-((S)-pyrrolidinyl)methoxy]pyridine, A-84543, a potent nicotinic acetylcholine receptor agonist. Bioorg Med Chem Lett8:249-54 (1999) Neuronal acetylcholine receptor subunit alpha-4/beta-2
Name:Neuronal acetylcholine receptor subunit alpha-4/beta-2
Type:Protein
Mol. Mass.:n/a
Description:n/a
Components:This complex has 2 components.
Component 1
Name:Neuronal acetylcholine receptor subunit alpha-4
Synonyms:ACHA4_HUMAN CHRNA4 protein Neuronal acetylcholine receptor protein alpha-4 subunit Nicotinic acetylcholine receptor alpha4/beta2/alpha5
Type:n/a
Mol. Mass.:69963.49
Organism:Homo sapiens (Human)
Description:NACHRA4
Residue:627
Component 2
Name:Neuronal acetylcholine receptor subunit beta-2
Synonyms:ACHB2_HUMAN Neuronal acetylcholine receptor protein beta-2 subunit | Nicotinic acetylcholine receptor alpha3/beta2/alpha5
Type:Protein
Mol. Mass.:57020.50
Organism:Homo sapiens (Human)
Description:P17787
Residue:502
BDBM50069840
NameBDBM50069840
Synonyms:2-Bromo-5-((S)-1-methyl-pyrrolidin-2-ylmethoxy)-pyridine | CHEMBL84827
TypeSmall organic molecule
Emp. Form.C11H15BrN2O
Mol. Mass.271.154
SMILESCN1CCC[C@H]1COc1ccc(Br)nc1