Reaction Details
TargetNicotinic acetylcholine receptor alpha9/alpha10
LigandBDBM50445324
Substrate/Competitorn/a
Meas. Tech.ChEMBL_1858087 (CHEMBL4358816)
IC50 109±n/a nM
Citation Liang, JTae, HSXu, XJiang, TAdams, DJYu, R Dimerization of ?-Conotoxins as a Strategy to Enhance the Inhibition of the Human ?7 and ?9?10 Nicotinic Acetylcholine Receptors. J Med Chem63:2974-2985 (2020) 
 
Nicotinic acetylcholine receptor alpha9/alpha10
Name:Nicotinic acetylcholine receptor alpha9/alpha10
Synonyms:Neuronal acetylcholine receptor subunit alpha-10/alpha-9
Type:n/a
Mol. Mass.:n/a
Description:ASSAY_ID of ChEMBL is 2193071
Components:This complex has 2 components.
Component 1
Name:Neuronal acetylcholine receptor subunit alpha-9
Type:Enzyme Catalytic Domain
Mol. Mass.:54522.69
Organism:RAT
Description:Cholinergic, Nicotinic Muscle 0 RAT::P43144
Residue:479
Component 2
Name:Neuronal acetylcholine receptor subunit alpha-10
Synonyms:ACH10_RAT Neuronal acetylcholine receptor protein alpha-10 subunit | Nicotinic acetylcholine receptor alpha9/alpha10
Type:PROTEIN
Mol. Mass.:49830.54
Organism:Rattus norvegicus
Description:ChEMBL_143222
Residue:447
BDBM50445324
NameBDBM50445324
Synonyms:CHEMBL3104237
TypeSmall organic molecule
Emp. Form.C71H103N23O25S4
Mol. Mass.1806.977
SMILESCC[C@H](C)[C@@H]1NC(=O)[C@H](CCC(O)=O)NC(=O)[C@@H]2CCCN2C(=O)[C@H](Cc2cnc[nH]2)NC(=O)[C@H](CC(O)=O)NC(=O)[C@H](Cc2ccc(O)cc2)NC(=O)[C@H](CC(N)=O)NC(=O)[C@@H]2CSSC[C@H](NC(=O)CN)C(=O)N[C@@H](CSSC[C@H](NC1=O)C(N)=O)C(=O)N[C@@H](CO)C(=O)N[C@@H](CC(O)=O)C(=O)N1CCC[C@H]1C(=O)N[C@@H](CCCN=C(N)N)C(=O)N2