Reaction Details
TargetD(2) dopamine receptor
LigandBDBM50061642
Substrate/Competitorn/a
Meas. Tech.ChEMBL_58479 (CHEMBL670410)
Ki 0.350000±n/a nM
Citation Mewshaw, REHusbands, MGildersleeve, ESWebb, MBShi, XMazandarani, HCockett, MIOchalski, RBrennan, JAAbou-Gharbia, MMarquis, KMcGaughey, GBCoupet, JAndree, TH New generation dopaminergic agents. 2. Discovery of 3-OH-phenoxyethylamine and 3-OH-N1-phenylpiperazine dopaminergic templates. Bioorg Med Chem Lett8:295-300 (1999) D(2) dopamine receptor
Name:D(2) dopamine receptor
Type:G Protein-Coupled Receptor (GPCR)
Mol. Mass.:50931.60
Organism:Rattus norvegicus (rat)
Description:P61169
Residue:444
BDBM50061642
NameBDBM50061642
Synonyms:(S)-3-(Benzylamino-methyl)-2,3-dihydro-benzo[1,4]dioxin-6-ol; oxalic acid CHEMBL423890
TypeSmall organic molecule
Emp. Form.C16H17NO3
Mol. Mass.271.3111
SMILESOc1ccc2OC[C@H](CNCc3ccccc3)Oc2c1