Reaction Details
TargetDihydroorotate dehydrogenase (quinone), mitochondrial
LigandBDBM50069939
Substrate/Competitorn/a
Meas. Tech.ChEBML_52889
Ki 13±n/a nM
Citation Pitts, WJJetter, JWPinto, DJOrwat, MJBatt, DGSherk, SRPetraitis, JJJacobson, ICCopeland, RADowling, RLJaffee, BDGardner, TLJones, EAMagolda, RL Structure-activity relationships (SAR) of some tetracyclic heterocycles related to the immunosuppressive agent Brequinar Sodium. Bioorg Med Chem Lett8:307-12 (1999) Dihydroorotate dehydrogenase (quinone), mitochondrial
Name:Dihydroorotate dehydrogenase (quinone), mitochondrial
Type:Enzyme
Mol. Mass.:42881.33
Organism:Homo sapiens (Human)
Description:Q02127
Residue:395
BDBM50069939
NameBDBM50069939
Synonyms:CHEMBL106467 | Sodium; 9-fluoro-3-p-tolyl-6H-thiochromeno[4,3-b]quinoline-7-carboxylate
TypeSmall organic molecule
Emp. Form.C24H15FNO2S
Mol. Mass.400.445
SMILESCc1ccc(cc1)-c1ccc-2c(SCc3c-2nc2ccc(F)cc2c3C([O-])=O)c1