Reaction Details
TargetSerine/threonine-protein kinase B-raf
LigandBDBM50514785
Substrate/Competitorn/a
Meas. Tech.ChEMBL_1858522 (CHEMBL4359251)
Kd 2.4±n/a nM
Citation Han, XRChen, LWei, YYu, WChen, YZhang, CJiao, BShi, TSun, LZhang, CXu, YLee, MRLuo, YPlewe, MBWang, J Discovery of Selective Small Molecule Degraders of BRAF-V600E. J Med Chem63:4069-4080 (2020) 
 
Serine/threonine-protein kinase B-raf
Name:Serine/threonine-protein kinase B-raf
Type:Serine/threonine-protein kinase
Mol. Mass.:84446.00
Organism:Homo sapiens (Human)
Description:P15056
Residue:766
BDBM50514785
NameBDBM50514785
Synonyms:CHEMBL4443903
TypeSmall organic molecule
Emp. Form.C48H54F2N10O10S
Mol. Mass.1001.065
SMILESCCCS(=O)(=O)Nc1ccc(F)c(c1F)-n1cc(-c2cncnc2)c2nc(ccc12)N(C)C1CCN(CC1)C(=O)CCOCCOCCOCCNc1cccc2C(=O)N(C3CCC(=O)NC3=O)C(=O)c12