Reaction Details
TargetSerine/threonine-protein kinase B-raf
LigandBDBM50457446
Substrate/Competitorn/a
Meas. Tech.ChEMBL_1858522 (CHEMBL4359251)
Kd 0.370000±n/a nM
Citation Han, XRChen, LWei, YYu, WChen, YZhang, CJiao, BShi, TSun, LZhang, CXu, YLee, MRLuo, YPlewe, MBWang, J Discovery of Selective Small Molecule Degraders of BRAF-V600E. J Med Chem63:4069-4080 (2020) 
 
Serine/threonine-protein kinase B-raf
Name:Serine/threonine-protein kinase B-raf
Type:Serine/threonine-protein kinase
Mol. Mass.:84446.00
Organism:Homo sapiens (Human)
Description:P15056
Residue:766
BDBM50457446
NameBDBM50457446
Synonyms:CHEMBL4212692
TypeSmall organic molecule
Emp. Form.C28H33F2N7O2S
Mol. Mass.569.669
SMILESCCCS(=O)(=O)Nc1ccc(F)c(c1F)-n1cc(-c2cncnc2)c2nc(ccc12)N(C)C1CCN(CC)CC1