Reaction Details
TargetSerine/threonine-protein kinase B-raf
LigandBDBM50514787
Substrate/Competitorn/a
Meas. Tech.ChEMBL_1858522 (CHEMBL4359251)
Kd 5.1±n/a nM
Citation Han, XRChen, LWei, YYu, WChen, YZhang, CJiao, BShi, TSun, LZhang, CXu, YLee, MRLuo, YPlewe, MBWang, J Discovery of Selective Small Molecule Degraders of BRAF-V600E. J Med Chem63:4069-4080 (2020) 
 
Serine/threonine-protein kinase B-raf
Name:Serine/threonine-protein kinase B-raf
Type:Serine/threonine-protein kinase
Mol. Mass.:84446.00
Organism:Homo sapiens (Human)
Description:P15056
Residue:766
BDBM50514787
NameBDBM50514787
Synonyms:CHEMBL4449322
TypeSmall organic molecule
Emp. Form.C43H41F2N7O8S
Mol. Mass.853.89
SMILESCCCS(=O)(=O)Nc1ccc(F)c(C(=O)c2c[nH]c3ncc(cc23)-c2ccc(CNC(=O)CCCCNc3ccc4C(=O)N(C5CCC(=O)N(C)C5=O)C(=O)c4c3)cc2)c1F