Reaction Details
TargetSerine/threonine-protein kinase B-raf
LigandBDBM50396483
Substrate/Competitorn/a
Meas. Tech.ChEMBL_1858521 (CHEMBL4359250)
Kd 58±n/a nM
Citation Han, XRChen, LWei, YYu, WChen, YZhang, CJiao, BShi, TSun, LZhang, CXu, YLee, MRLuo, YPlewe, MBWang, J Discovery of Selective Small Molecule Degraders of BRAF-V600E. J Med Chem63:4069-4080 (2020) 
 
Serine/threonine-protein kinase B-raf
Name:Serine/threonine-protein kinase B-raf
Type:Serine/threonine-protein kinase
Mol. Mass.:84446.00
Organism:Homo sapiens (Human)
Description:P15056
Residue:766
BDBM50396483
NameBDBM50396483
Synonyms:PLX-4032 Ro 5185426 US11332479, Compound Vemurafenib US9388165, Reference, Vemurafenib (PLX-4032) VEMURAFENIB
TypeSmall organic molecule
Emp. Form.C23H18ClF2N3O3S
Mol. Mass.489.922
SMILESCCCS(=O)(=O)Nc1ccc(F)c(C(=O)c2c[nH]c3ncc(cc23)-c2ccc(Cl)cc2)c1F