Reaction Details
TargetBeta-2 adrenergic receptor
LigandBDBM50070141
Substrate/Competitorn/a
Meas. Tech.ChEBML_38316
IC50 120±n/a nM
Citation Weber, AEMathvink, RJPerkins, LHutchins, JECandelore, MRTota, LStrader, CDWyvratt, MJFisher, MH Potent, selective benzenesulfonamide agonists of the human beta 3 adrenergic receptor. Bioorg Med Chem Lett8:1101-6 (1999) Beta-2 adrenergic receptor
Name:Beta-2 adrenergic receptor
Type:n/a
Mol. Mass.:46461.69
Organism:Homo sapiens (Human)
Description:P07550
Residue:413
BDBM50070141
NameBDBM50070141
Synonyms:2-Phenyl-ethanesulfonic acid (4-{2-[(S)-2-hydroxy-3-(4-hydroxy-phenoxy)-propylamino]-ethyl}-phenyl)-amide | CHEMBL12674
TypeSmall organic molecule
Emp. Form.C25H30N2O5S
Mol. Mass.470.581
SMILESO[C@@H](CNCCc1ccc(NS(=O)(=O)CCc2ccccc2)cc1)COc1ccc(O)cc1